Reaction Details
Target5-hydroxytryptamine receptor 3A
LigandBDBM50329758
Substrate/Competitorn/a
Meas. Tech.ChEMBL_674333 (CHEMBL1274533)
Ki 36.4±n/a nM
Citation Yang, ZFairfax, DJMaeng, JHMasih, LUsyatinsky, AHassler, CIsaacson, SFitzpatrick, KDeOrazio, RJChen, JHarding, JPIsherwood, MDobritsa, SChristensen, KLWierschke, JDBliss, BIPeterson, LHBeer, CMCioffi, CLynch, MRennells, WMRichards, JJRust, TKhmelnitsky, YLCohen, MLManning, DD Discovery of 2-substituted benzoxazole carboxamides as 5-HT3 receptor antagonists. Bioorg Med Chem Lett20:6538-41 (2010) 
 
5-hydroxytryptamine receptor 3A
Name:5-hydroxytryptamine receptor 3A
Type:Protein
Mol. Mass.:55283.27
Organism:Homo sapiens (Human)
Description:P46098
Residue:478
BDBM50329758
NameBDBM50329758
Synonyms:(S)-2-(methylamino)-N-(quinuclidin-3-yl)benzo[d]oxazole-4-carboxamide | CHEMBL1272177
TypeSmall organic molecule
Emp. Form.C16H20N4O2
Mol. Mass.300.3556
SMILESCNc1nc2c(cccc2o1)C(=O)N[C@@H]1CN2CCC1CC2