Reaction Details
TargetCarbonic anhydrase 2
LigandBDBM50329764
Substrate/Competitorn/a
Meas. Tech.ChEMBL_674742 (CHEMBL1273995)
Kd 24±n/a nM
Citation Sudžius, JBaranauskiene, LGolovenko, DMatuliene, JMichailoviene, VTorresan, JJachno, JSukackaite, RManakova, EGražulis, STumkevičius, SMatulis, D 4-[N-(substituted 4-pyrimidinyl)amino]benzenesulfonamides as inhibitors of carbonic anhydrase isozymes I, II, VII, and XIII. Bioorg Med Chem18:7413-21 (2010) 
 
Carbonic anhydrase 2
Name:Carbonic anhydrase 2
Type:Enzyme
Mol. Mass.:29250.71
Organism:Homo sapiens (Human)
Description:P00918
Residue:260
BDBM50329764
NameBDBM50329764
Synonyms:4-({[6-chloro-5-formyl-2-(methylsulfanyl)pyrimidin-4-yl]amino}methyl)benzenesulfonamide CHEMBL1233735
TypeSmall organic molecule
Emp. Form.C13H13ClN4O3S2
Mol. Mass.372.85
SMILESCSc1nc(Cl)c(C=O)c(NCc2ccc(cc2)S(N)(=O)=O)n1