Reaction Details
TargetCarbonic anhydrase 2
LigandBDBM50329770
Substrate/Competitorn/a
Meas. Tech.ChEMBL_674743 (CHEMBL1273996)
Kd 56±n/a nM
Citation Sudžius, JBaranauskiene, LGolovenko, DMatuliene, JMichailoviene, VTorresan, JJachno, JSukackaite, RManakova, EGražulis, STumkevičius, SMatulis, D 4-[N-(substituted 4-pyrimidinyl)amino]benzenesulfonamides as inhibitors of carbonic anhydrase isozymes I, II, VII, and XIII. Bioorg Med Chem18:7413-21 (2010) 
 
Carbonic anhydrase 2
Name:Carbonic anhydrase 2
Type:Enzyme
Mol. Mass.:29250.71
Organism:Homo sapiens (Human)
Description:P00918
Residue:260
BDBM50329770
NameBDBM50329770
Synonyms:4-{[(6-methoxy-5-nitropyrimidin-4-yl)amino]methyl}benzenesulfonamide CHEMBL1233725
TypeSmall organic molecule
Emp. Form.C12H13N5O5S
Mol. Mass.339.327
SMILESCOc1ncnc(NCc2ccc(cc2)S(N)(=O)=O)c1[N+]([O-])=O