Reaction Details
TargetCarbonic anhydrase 13
LigandBDBM50329759
Substrate/Competitorn/a
Meas. Tech.ChEMBL_674746 (CHEMBL1273999)
Kd 2±n/a nM
Citation Sudžius, JBaranauskiene, LGolovenko, DMatuliene, JMichailoviene, VTorresan, JJachno, JSukackaite, RManakova, EGražulis, STumkevičius, SMatulis, D 4-[N-(substituted 4-pyrimidinyl)amino]benzenesulfonamides as inhibitors of carbonic anhydrase isozymes I, II, VII, and XIII. Bioorg Med Chem18:7413-21 (2010) 
 
Carbonic anhydrase 13
Name:Carbonic anhydrase 13
Type:Enzyme
Mol. Mass.:29445.78
Organism:Homo sapiens (Human)
Description:Q8N1Q1
Residue:262
BDBM50329759
NameBDBM50329759
Synonyms:4-[(6-chloro-5-nitropyrimidin-4-yl)amino]benzenesulfonamide CHEMBL1233722
TypeSmall organic molecule
Emp. Form.C10H8ClN5O4S
Mol. Mass.329.72
SMILESNS(=O)(=O)c1ccc(Nc2ncnc(Cl)c2[N+]([O-])=O)cc1