Reaction Details
TargetOligo-1,6-glucosidase IMA1
LigandBDBM50329781
Substrate/Competitorn/a
Meas. Tech.ChEMBL_674760 (CHEMBL1274068)
Ki 313000±n/a nM
Citation Aguilar-Moncayo, MGarcía-Moreno, MIStütz, AEGarcía Fernández, JMWrodnigg, TMOrtiz Mellet, C Fluorescent-tagged sp2-iminosugars with potentß-glucosidase inhibitory activity. Bioorg Med Chem18:7439-45 (2010) 
 
Oligo-1,6-glucosidase IMA1
Name:Oligo-1,6-glucosidase IMA1
Type:Protein
Mol. Mass.:68577.59
Organism:Saccharomyces cerevisiae S288c (Baker's yeast)
Description:n/a
Residue:589
BDBM50329781
NameBDBM50329781
Synonyms:5-N,6-S-[N'-[4-(7'-Diethylaminocoumarin-30-ylcarboxamido)butyl]iminomethylidene]-6-thionojirimycin | CHEMBL1272019
TypeSmall organic molecule
Emp. Form.C24H34N4O8S2
Mol. Mass.570.679
SMILESCCN(CC)c1ccc2cc(c(=O)oc2c1)S(=O)(=O)NCCCC\N=C1/SC[C@@H]2[C@@H](O)[C@H](O)[C@@H](O)[C@@H](O)N12