Reaction Details
TargetTGF-beta receptor type-1
LigandBDBM50329798
Substrate/Competitorn/a
Meas. Tech.ChEMBL_674822 (CHEMBL1272395)
IC50 7±n/a nM
Citation Roth, GJHeckel, ABrandl, TGrauert, MHoerer, SKley, JTSchnapp, GBaum, PMennerich, DSchnapp, APark, JE Design, synthesis, and evaluation of indolinones as inhibitors of the transforming growth factorß receptor I (TGFßRI). J Med Chem53:7287-95 (2010) 
 
TGF-beta receptor type-1
Name:TGF-beta receptor type-1
Type:enzyme
Mol. Mass.:55968.24
Organism:Homo sapiens (Human)
Description:P36897
Residue:503
BDBM50329798
NameBDBM50329798
Synonyms:(Z)-N-ethyl-N-methyl-3-((4-(N-methyl-2-(4-methylpiperazin-1-yl)acetamido)phenylamino)(phenyl)methylene)-2-oxoindoline-6-carboxamide | CHEMBL1269806
TypeSmall organic molecule
Emp. Form.C33H38N6O3
Mol. Mass.566.6932
SMILESCCN(C)C(=O)c1ccc2C(C(=Nc3ccc(cc3)N(C)C(=O)CN3CCN(C)CC3)c3ccccc3)C(=O)Nc2c1