Reaction Details
TargetTGF-beta receptor type-1
LigandBDBM50329805
Substrate/Competitorn/a
Meas. Tech.ChEMBL_674822 (CHEMBL1272395)
IC50 47±n/a nM
Citation Roth, GJHeckel, ABrandl, TGrauert, MHoerer, SKley, JTSchnapp, GBaum, PMennerich, DSchnapp, APark, JE Design, synthesis, and evaluation of indolinones as inhibitors of the transforming growth factorß receptor I (TGFßRI). J Med Chem53:7287-95 (2010) 
 
TGF-beta receptor type-1
Name:TGF-beta receptor type-1
Type:enzyme
Mol. Mass.:55968.24
Organism:Homo sapiens (Human)
Description:P36897
Residue:503
BDBM50329805
NameBDBM50329805
Synonyms:(Z)-3-((4-(2-(dimethylamino)ethyl)phenylamino)(phenyl)methylene)-N-ethyl-2-oxoindoline-6-carboxamide | CHEMBL1271577
TypeSmall organic molecule
Emp. Form.C28H30N4O2
Mol. Mass.454.5634
SMILESCCNC(=O)c1ccc2C(C(=Nc3ccc(CCN(C)C)cc3)c3ccccc3)C(=O)Nc2c1