Reaction Details
TargetProstaglandin E2 receptor EP3 subtype
LigandBDBM50417190
Substrate/Competitorn/a
Meas. Tech.ChEMBL_675685 (CHEMBL1274046)
Ki 100±n/a nM
Citation Li, YHTseng, PSEvans, KAJaworski, JPMorrow, DMFries, HEWu, CWEdwards, RMJin, J 3-Urea-1-(phenylmethyl)-pyridones as novel, potent, and selective EP3 receptor antagonists. Bioorg Med Chem Lett20:6744-7 (2010) 
 
Prostaglandin E2 receptor EP3 subtype
Name:Prostaglandin E2 receptor EP3 subtype
Type:Enzyme
Mol. Mass.:43335.03
Organism:Homo sapiens (Human)
Description:P43115
Residue:390
BDBM50417190
NameBDBM50417190
Synonyms:CHEMBL1272086
TypeSmall organic molecule
Emp. Form.C21H20FN3O2
Mol. Mass.365.4008
SMILESCCc1cccc(NC(=O)Nc2cccn(Cc3ccccc3F)c2=O)c1