Reaction Details
TargetProstaglandin E2 receptor EP3 subtype
LigandBDBM50417191
Substrate/Competitorn/a
Meas. Tech.ChEMBL_675685 (CHEMBL1274046)
Ki 6.31±n/a nM
Citation Li, YHTseng, PSEvans, KAJaworski, JPMorrow, DMFries, HEWu, CWEdwards, RMJin, J 3-Urea-1-(phenylmethyl)-pyridones as novel, potent, and selective EP3 receptor antagonists. Bioorg Med Chem Lett20:6744-7 (2010) 
 
Prostaglandin E2 receptor EP3 subtype
Name:Prostaglandin E2 receptor EP3 subtype
Type:Enzyme
Mol. Mass.:43335.03
Organism:Homo sapiens (Human)
Description:P43115
Residue:390
BDBM50417191
NameBDBM50417191
Synonyms:CHEMBL1272136
TypeSmall organic molecule
Emp. Form.C21H19ClFN3O2
Mol. Mass.399.846
SMILESCCc1cccc(NC(=O)Nc2cccn(Cc3c(F)cccc3Cl)c2=O)c1