Reaction Details
TargetProstaglandin E2 receptor EP3 subtype
LigandBDBM50417193
Substrate/Competitorn/a
Meas. Tech.ChEMBL_675685 (CHEMBL1274046)
Ki 794.33±n/a nM
Citation Li, YHTseng, PSEvans, KAJaworski, JPMorrow, DMFries, HEWu, CWEdwards, RMJin, J 3-Urea-1-(phenylmethyl)-pyridones as novel, potent, and selective EP3 receptor antagonists. Bioorg Med Chem Lett20:6744-7 (2010) 
 
Prostaglandin E2 receptor EP3 subtype
Name:Prostaglandin E2 receptor EP3 subtype
Type:Enzyme
Mol. Mass.:43335.03
Organism:Homo sapiens (Human)
Description:P43115
Residue:390
BDBM50417193
NameBDBM50417193
Synonyms:CHEMBL1272028
TypeSmall organic molecule
Emp. Form.C20H17ClFN3O3
Mol. Mass.401.819
SMILESCOc1cccc(NC(=O)Nc2cccn(Cc3cc(F)ccc3Cl)c2=O)c1