Reaction Details
TargetProstaglandin E2 receptor EP3 subtype
LigandBDBM50417206
Substrate/Competitorn/a
Meas. Tech.ChEMBL_675685 (CHEMBL1274046)
Ki 63.1±n/a nM
Citation Li, YHTseng, PSEvans, KAJaworski, JPMorrow, DMFries, HEWu, CWEdwards, RMJin, J 3-Urea-1-(phenylmethyl)-pyridones as novel, potent, and selective EP3 receptor antagonists. Bioorg Med Chem Lett20:6744-7 (2010) 
 
Prostaglandin E2 receptor EP3 subtype
Name:Prostaglandin E2 receptor EP3 subtype
Type:Enzyme
Mol. Mass.:43335.03
Organism:Homo sapiens (Human)
Description:P43115
Residue:390
BDBM50417206
NameBDBM50417206
Synonyms:CHEMBL1271527
TypeSmall organic molecule
Emp. Form.C22H22ClN3O2
Mol. Mass.395.882
SMILESCC(C)c1cccc(NC(=O)Nc2cccn(Cc3ccccc3Cl)c2=O)c1