Reaction Details
TargetCarbonic anhydrase 1
LigandBDBM50329832
Substrate/Competitorn/a
Meas. Tech.ChEMBL_675712 (CHEMBL1272346)
Kd 11000±n/a nM
Citation Capkauskaite, EBaranauskiene, LGolovenko, DManakova, EGražulis, STumkevičius, SMatulis, D Indapamide-like benzenesulfonamides as inhibitors of carbonic anhydrases I, II, VII, and XIII. Bioorg Med Chem18:7357-64 (2010) 
 
Carbonic anhydrase 1
Name:Carbonic anhydrase 1
Type:Enzyme
Mol. Mass.:28873.37
Organism:Homo sapiens (Human)
Description:P00915
Residue:261
BDBM50329832
NameBDBM50329832
Synonyms:5-(1H-Benzimidazol-1-ylacetyl)-2-chlorobenzenesulfonamide N-alkylated benzimidazole derivative, 4a | carbonic anhydrase (CA) inhibitors, benzenesulphonamide ligand, 4
TypeSmall organic molecule
Emp. Form.C15H12ClN3O3S
Mol. Mass.349.792
SMILESNS(=O)(=O)c1cc(ccc1Cl)C(=O)Cn1cnc2ccccc12