Reaction Details
TargetCarbonic anhydrase 2
LigandBDBM50329822
Substrate/Competitorn/a
Meas. Tech.ChEMBL_675713 (CHEMBL1272347)
Kd 1600±n/a nM
Citation Capkauskaite, EBaranauskiene, LGolovenko, DManakova, EGražulis, STumkevičius, SMatulis, D Indapamide-like benzenesulfonamides as inhibitors of carbonic anhydrases I, II, VII, and XIII. Bioorg Med Chem18:7357-64 (2010) 
 
Carbonic anhydrase 2
Name:Carbonic anhydrase 2
Type:Enzyme
Mol. Mass.:29250.71
Organism:Homo sapiens (Human)
Description:P00918
Residue:260
BDBM50329822
NameBDBM50329822
Synonyms:5-[(2-Benzyl-1H-benzimidazol-1-yl)acetyl]-2-chlorobenzenesulfonamide N-alkylated benzimidazole derivative, 4d | carbonic anhydrase (CA) inhibitors, benzenesulphonamide ligand, 5
TypeSmall organic molecule
Emp. Form.C22H18ClN3O3S
Mol. Mass.439.915
SMILESNS(=O)(=O)c1cc(ccc1Cl)C(=O)Cn1c(Cc2ccccc2)nc2ccccc12