Reaction Details
TargetCarbonic anhydrase 7
LigandBDBM25901
Substrate/Competitorn/a
Meas. Tech.ChEMBL_675714 (CHEMBL1272348)
Kd 300±n/a nM
Citation Capkauskaite, EBaranauskiene, LGolovenko, DManakova, EGražulis, STumkevičius, SMatulis, D Indapamide-like benzenesulfonamides as inhibitors of carbonic anhydrases I, II, VII, and XIII. Bioorg Med Chem18:7357-64 (2010) 
 
Carbonic anhydrase 7
Name:Carbonic anhydrase 7
Type:Enzyme
Mol. Mass.:29664.11
Organism:Homo sapiens (Human)
Description:Human cloned isozyme.
Residue:264
BDBM25901
NameBDBM25901
Synonyms:4-chloro-N-(2-methyl-2,3-dihydro-1H-indol-1-yl)-3-sulfamoylbenzamide Indapamide Lozol | Noranat
TypeSmall organic molecule
Emp. Form.C16H16ClN3O3S
Mol. Mass.365.835
SMILESCC1Cc2ccccc2N1NC(=O)c1ccc(Cl)c(c1)S(N)(=O)=O