Reaction Details
TargetCarbonic anhydrase 13
LigandBDBM50329826
Substrate/Competitorn/a
Meas. Tech.ChEMBL_675715 (CHEMBL1272349)
Kd 400±n/a nM
Citation Capkauskaite, EBaranauskiene, LGolovenko, DManakova, EGražulis, STumkevičius, SMatulis, D Indapamide-like benzenesulfonamides as inhibitors of carbonic anhydrases I, II, VII, and XIII. Bioorg Med Chem18:7357-64 (2010) 
 
Carbonic anhydrase 13
Name:Carbonic anhydrase 13
Type:Enzyme
Mol. Mass.:29445.78
Organism:Homo sapiens (Human)
Description:Q8N1Q1
Residue:262
BDBM50329826
NameBDBM50329826
Synonyms:2-Chloro-5-[(2-isopropyl-1H-benzimidazol-1-yl)acetyl]benzenesulfonamide N-alkylated benzimidazole derivative, 4h
TypeSmall organic molecule
Emp. Form.C18H18ClN3O3S
Mol. Mass.391.872
SMILESCC(C)c1nc2ccccc2n1CC(=O)c1ccc(Cl)c(c1)S(N)(=O)=O