Reaction Details
TargetPeptidyl-prolyl cis-trans isomerase NIMA-interacting 1
LigandBDBM50329872
Substrate/Competitorn/a
Meas. Tech.ChEMBL_675735 (CHEMBL1272369)
IC50 4100±n/a nM
Citation Potter, AOldfield, VNunns, CFromont, CRay, SNorthfield, CJBryant, CJScrace, SFRobinson, DMatossova, NBaker, LDokurno, PSurgenor, AEDavis, BRichardson, CMMurray, JBMoore, JD Discovery of cell-active phenyl-imidazole Pin1 inhibitors by structure-guided fragment evolution. Bioorg Med Chem Lett20:6483-8 (2010) 
 
Peptidyl-prolyl cis-trans isomerase NIMA-interacting 1
Name:Peptidyl-prolyl cis-trans isomerase NIMA-interacting 1
Type:PROTEIN
Mol. Mass.:18248.11
Organism:Homo sapiens (Human)
Description:ChEMBL_1502595
Residue:163
BDBM50329872
NameBDBM50329872
Synonyms:4-((2-amino-2-oxoethyl)(methyl)carbamoyl)-2-phenyl-1H-imidazole-5-carboxylic acid CHEMBL1230285
TypeSmall organic molecule
Emp. Form.C14H14N4O4
Mol. Mass.302.2854
SMILESCN(CC(N)=O)C(=O)c1nc([nH]c1C(O)=O)-c1ccccc1