Reaction Details
TargetHypoxia-inducible factor 1-alpha
LigandBDBM50329888
Substrate/Competitorn/a
Meas. Tech.ChEMBL_675858 (CHEMBL1272616)
IC50 3500±n/a nM
Citation Yewalkar, NDeore, VPadgaonkar, AManohar, SSahu, BKumar, PJalota-Badhwar, AJoshi, KSSharma, SKumar, S Development of novel inhibitors targeting HIF-1a towards anticancer drug discovery. Bioorg Med Chem Lett20:6426-9 (2010) 
 
Hypoxia-inducible factor 1-alpha
Name:Hypoxia-inducible factor 1-alpha
Type:Protein
Mol. Mass.:92647.24
Organism:Homo sapiens (Human)
Description:Q16665
Residue:826
BDBM50329888
NameBDBM50329888
Synonyms:2-chloro-N-(6-(4-methoxy-6-(trifluoromethyl)pyrimidin-2-yl)pyridin-3-yl)acetamide | CHEMBL1271979
TypeSmall organic molecule
Emp. Form.C13H10ClF3N4O2
Mol. Mass.346.692
SMILESCOc1cc(nc(n1)-c1ccc(NC(=O)CCl)cn1)C(F)(F)F