Reaction Details
TargetHypoxia-inducible factor 1-alpha
LigandBDBM50329895
Substrate/Competitorn/a
Meas. Tech.ChEMBL_675858 (CHEMBL1272616)
IC50 800±n/a nM
Citation Yewalkar, NDeore, VPadgaonkar, AManohar, SSahu, BKumar, PJalota-Badhwar, AJoshi, KSSharma, SKumar, S Development of novel inhibitors targeting HIF-1a towards anticancer drug discovery. Bioorg Med Chem Lett20:6426-9 (2010) 
 
Hypoxia-inducible factor 1-alpha
Name:Hypoxia-inducible factor 1-alpha
Type:Protein
Mol. Mass.:92647.24
Organism:Homo sapiens (Human)
Description:Q16665
Residue:826
BDBM50329895
NameBDBM50329895
Synonyms:2-chloro-N-(6-(4-hydroxy-6-(trifluoromethyl)pyrimidin-2-yl)pyridin-3-yl)acetamide | CHEMBL1271866
TypeSmall organic molecule
Emp. Form.C12H8ClF3N4O2
Mol. Mass.332.666
SMILESFC(F)(F)c1cc(=O)[nH]c(n1)-c1ccc(NC(=O)CCl)cn1