Reaction Details
TargetHypoxia-inducible factor 1-alpha
LigandBDBM50329896
Substrate/Competitorn/a
Meas. Tech.ChEMBL_675858 (CHEMBL1272616)
IC50 1500±n/a nM
Citation Yewalkar, NDeore, VPadgaonkar, AManohar, SSahu, BKumar, PJalota-Badhwar, AJoshi, KSSharma, SKumar, S Development of novel inhibitors targeting HIF-1a towards anticancer drug discovery. Bioorg Med Chem Lett20:6426-9 (2010) 
 
Hypoxia-inducible factor 1-alpha
Name:Hypoxia-inducible factor 1-alpha
Type:Protein
Mol. Mass.:92647.24
Organism:Homo sapiens (Human)
Description:Q16665
Residue:826
BDBM50329896
NameBDBM50329896
Synonyms:CHEMBL1271980 | N-(6-(4-(allyloxy)-5-chloro-6-methylpyrimidin-2-yl)pyridin-3-yl)-2-chloroacetamide
TypeSmall organic molecule
Emp. Form.C15H14Cl2N4O2
Mol. Mass.353.203
SMILESCc1nc(nc(OCC=C)c1Cl)-c1ccc(NC(=O)CCl)cn1