Reaction Details
TargetMelanocortin receptor 4
LigandBDBM50329958
Substrate/Competitorn/a
Meas. Tech.ChEMBL_675992 (CHEMBL1272930)
IC50 0.84±n/a nM
Citation He, SYe, ZDobbelaar, PHBakshi, RKHong, QDellureficio, JPSebhat, IKGuo, LLiu, JJian, TLai, YFranklin, CLReibarkh, MHolmes, MAWeinberg, DHMacNeil, TTang, RTamvakopoulos, CPeng, QMiller, RRStearns, RAChen, HYChen, ASStrack, AMFong, TMWyvratt, MJNargund, RP Discovery of highly potent and efficacious MC4R agonists with spiroindane N-Me-1,2,4-triazole privileged structures for the treatment of obesity. Bioorg Med Chem Lett20:6524-32 (2010) 
 
Melanocortin receptor 4
Name:Melanocortin receptor 4
Type:Enzyme
Mol. Mass.:36949.50
Organism:Homo sapiens (Human)
Description:P32245
Residue:332
BDBM50329958
NameBDBM50329958
Synonyms:(6-chloro-5-methyl-3-(2-(1-methyl-1H-1,2,4-triazol-5-yl)propan-2-yl)-2,3-dihydrospiro[indene-1,4'-piperidine]-1'-yl)((3S,4R)-4-(2,4-difluorophenyl)-1-(tetrahydro-2H-pyran-4-yl)pyrrolidin-3-yl)methanone | CHEMBL1269575
TypeSmall organic molecule
Emp. Form.C36H44ClF2N5O2
Mol. Mass.652.217
SMILESCc1cc2[C@H](CC3(CCN(CC3)C(=O)[C@@H]3CN(C[C@H]3c3ccc(F)cc3F)C3CCOCC3)c2cc1Cl)C(C)(C)c1ncnn1C