Reaction Details
TargetCytochrome P450 3A4
LigandBDBM50330016
Substrate/Competitorn/a
Meas. Tech.ChEMBL_676065 (CHEMBL1273059)
IC50 0.5±n/a nM
Citation Li, HXu, RCole, DClader, JWGreenlee, WJNomeir, AASong, LZhang, L Design, synthesis, and structure-activity relationship studies of N-arylsulfonyl morpholines as¿-secretase inhibitors. Bioorg Med Chem Lett20:6606-9 (2010) 
 
Cytochrome P450 3A4
Name:Cytochrome P450 3A4
Type:Enzyme
Mol. Mass.:57349.57
Organism:Homo sapiens (Human)
Description:n/a
Residue:503
BDBM50330016
NameBDBM50330016
Synonyms:((3R,5R)-4-(4-chlorophenylsulfonyl)-5-(1-methylcyclopropyl)morpholin-3-yl)methyl 4-(1-hydroxy-2-methylpropan-2-yl)piperazine-1-carboxylate | CHEMBL1271822
TypeSmall organic molecule
Emp. Form.C24H36ClN3O6S
Mol. Mass.530.077
SMILESCC(C)(CO)N1CCN(CC1)C(=O)OC[C@H]1COC[C@H](N1S(=O)(=O)c1ccc(Cl)cc1)C1(C)CC1