Reaction Details
TargetCytochrome P450 3A4
LigandBDBM50330021
Substrate/Competitorn/a
Meas. Tech.ChEMBL_676065 (CHEMBL1273059)
IC50 3.2±n/a nM
Citation Li, HXu, RCole, DClader, JWGreenlee, WJNomeir, AASong, LZhang, L Design, synthesis, and structure-activity relationship studies of N-arylsulfonyl morpholines as¿-secretase inhibitors. Bioorg Med Chem Lett20:6606-9 (2010) 
 
Cytochrome P450 3A4
Name:Cytochrome P450 3A4
Type:Enzyme
Mol. Mass.:57349.57
Organism:Homo sapiens (Human)
Description:n/a
Residue:503
BDBM50330021
NameBDBM50330021
Synonyms:1-((3R,5R)-4-(4-chlorophenylsulfonyl)-5-(cyclopropylmethyl)morpholin-3-yl)cyclopropyl 5-(2-hydroxyethyl)-2,5-diazabicyclo[2.2.1]heptane-2-carboxylate | CHEMBL1272045
TypeSmall organic molecule
Emp. Form.C25H34ClN3O6S
Mol. Mass.540.072
SMILESOCCN1CC2CC1CN2C(=O)OC1(CC1)[C@H]1COC[C@@H](CC2CC2)N1S(=O)(=O)c1ccc(Cl)cc1