Reaction Details
TargetApoptosis regulator Bcl-2
LigandBDBM50330249
Substrate/Competitorn/a
Meas. Tech.ChEMBL_676276 (CHEMBL1273517)
Ki 2080±n/a nM
Citation Wei, JKitada, SStebbins, JLPlaczek, WZhai, DWu, BRega, MFZhang, ZCellitti, JYang, LDahl, RReed, JCPellecchia, M Synthesis and biological evaluation of Apogossypolone derivatives as pan-active inhibitors of antiapoptotic B-cell lymphoma/leukemia-2 (Bcl-2) family proteins. J Med Chem53:8000-11 (2010) 
 
Apoptosis regulator Bcl-2
Name:Apoptosis regulator Bcl-2
Type:Homodimer or heterodimer
Mol. Mass.:26269.11
Organism:Homo sapiens (Human)
Description:P10415
Residue:239
BDBM50330249
NameBDBM50330249
Synonyms:6,6',7,7'-Tetrahydroxy-3,3'-dimethyl-5,5'-bis(4-methylphenethyl)-2,2'-binaphthyl-1,1',4,4'-tetraone | CHEMBL1269076
TypeSmall organic molecule
Emp. Form.C40H34O8
Mol. Mass.642.6932
SMILESCc1ccc(CC=c2c(O)c(O)cc3c(O)c(-c4c(O)c5cc(O)c(O)c(=CCc6ccc(C)cc6)c5c(O)c4=C)c(=C)c(O)c23)cc1