Reaction Details
TargetBcl-2-related protein A1
LigandBDBM50330249
Substrate/Competitorn/a
Meas. Tech.ChEMBL_676277 (CHEMBL1273518)
Ki 9330±n/a nM
Citation Wei, JKitada, SStebbins, JLPlaczek, WZhai, DWu, BRega, MFZhang, ZCellitti, JYang, LDahl, RReed, JCPellecchia, M Synthesis and biological evaluation of Apogossypolone derivatives as pan-active inhibitors of antiapoptotic B-cell lymphoma/leukemia-2 (Bcl-2) family proteins. J Med Chem53:8000-11 (2010) 
 
Bcl-2-related protein A1
Name:Bcl-2-related protein A1
Type:Apoptosis regulator protein
Mol. Mass.:20130.01
Organism:Homo sapiens (Human)
Description:n/a
Residue:175
BDBM50330249
NameBDBM50330249
Synonyms:6,6',7,7'-Tetrahydroxy-3,3'-dimethyl-5,5'-bis(4-methylphenethyl)-2,2'-binaphthyl-1,1',4,4'-tetraone | CHEMBL1269076
TypeSmall organic molecule
Emp. Form.C40H34O8
Mol. Mass.642.6932
SMILESCc1ccc(CC=c2c(O)c(O)cc3c(O)c(-c4c(O)c5cc(O)c(O)c(=CCc6ccc(C)cc6)c5c(O)c4=C)c(=C)c(O)c23)cc1