Reaction Details
TargetApoptosis regulator Bcl-2
LigandBDBM50330253
Substrate/Competitorn/a
Meas. Tech.ChEMBL_676276 (CHEMBL1273517)
Ki 4470±n/a nM
Citation Wei, JKitada, SStebbins, JLPlaczek, WZhai, DWu, BRega, MFZhang, ZCellitti, JYang, LDahl, RReed, JCPellecchia, M Synthesis and biological evaluation of Apogossypolone derivatives as pan-active inhibitors of antiapoptotic B-cell lymphoma/leukemia-2 (Bcl-2) family proteins. J Med Chem53:8000-11 (2010) 
 
Apoptosis regulator Bcl-2
Name:Apoptosis regulator Bcl-2
Type:Homodimer or heterodimer
Mol. Mass.:26269.11
Organism:Homo sapiens (Human)
Description:P10415
Residue:239
BDBM50330253
NameBDBM50330253
Synonyms:5,5'-Bis(2-cyclohexylethyl)-6,6',7,7'-tetrahydroxy-3,3'-dimethyl-2,2'-binaphthyl-1,1',4,4'-tetraone | CHEMBL1269074
TypeSmall organic molecule
Emp. Form.C38H42O8
Mol. Mass.626.7353
SMILESOc1cc2c(O)c(-c3c(O)c4cc(O)c(O)c(=CCC5CCCCC5)c4c(O)c3=C)c(=C)c(O)c2c(=CCC2CCCCC2)c1O