Reaction Details
TargetCyclin-dependent kinase 4/G1/S-specific cyclin-D1
LigandBDBM50330262
Substrate/Competitorn/a
Meas. Tech.ChEMBL_676328 (CHEMBL1273629)
IC50 79±n/a nM
Citation Cho, YSBorland, MBrain, CChen, CHCheng, HChopra, RChung, KGroarke, JHe, GHou, YKim, SKovats, SLu, YO'Reilly, MShen, JSmith, TTrakshel, GVögtle, MXu, MXu, MSung, MJ 4-(Pyrazol-4-yl)-pyrimidines as selective inhibitors of cyclin-dependent kinase 4/6. J Med Chem53:7938-57 (2010) 
 
Cyclin-dependent kinase 4/G1/S-specific cyclin-D1
Name:Cyclin-dependent kinase 4/G1/S-specific cyclin-D1
Type:Protein Complex
Mol. Mass.:n/a
Description:CDK4/D1 complexes were purified from insect cells co-infected with baculovirus vectors containing each of the components.
Components:This complex has 2 components.
Component 1
Name:Cyclin-dependent kinase 4
Synonyms:CDK4 Cell division protein kinase 4 PSK-J3
Type:Enzyme Subunit
Mol. Mass.:33731.96
Organism:Homo sapiens (Human)
Description:P11802
Residue:303
Component 2
Name:G1/S-specific cyclin-D1
Synonyms:B-cell lymphoma 1 protein BCL-1 oncogene CCND1 PRAD1 | PRAD1 oncogene
Type:Enzyme Subunit
Mol. Mass.:33717.70
Organism:Homo sapiens (Human)
Description:n/a
Residue:295
BDBM50330262
NameBDBM50330262
Synonyms:CHEMBL1272171 | N*6'*-[4-(5-Isopropyl-3-trifluoromethyl-1H-pyrazol-4-yl)-pyrimidin-2-yl]-N*4*,N*4*-dimethyl-3,4,5,6-tetrahydro-2H-[1,3']-bipyridinyl-4,6'-diamine
TypeSmall organic molecule
Emp. Form.C23H29F3N8
Mol. Mass.474.5252
SMILESCC(C)c1[nH]nc(c1-c1ccnc(Nc2ccc(cn2)N2CCC(CC2)N(C)C)n1)C(F)(F)F