Reaction Details
TargetCyclin-dependent kinase 6/G1/S-specific cyclin-D3
LigandBDBM50330265
Substrate/Competitorn/a
Meas. Tech.ChEMBL_676331 (CHEMBL1273632)
IC50 231±n/a nM
Citation Cho, YSBorland, MBrain, CChen, CHCheng, HChopra, RChung, KGroarke, JHe, GHou, YKim, SKovats, SLu, YO'Reilly, MShen, JSmith, TTrakshel, GVögtle, MXu, MXu, MSung, MJ 4-(Pyrazol-4-yl)-pyrimidines as selective inhibitors of cyclin-dependent kinase 4/6. J Med Chem53:7938-57 (2010) 
 
Cyclin-dependent kinase 6/G1/S-specific cyclin-D3
Name:Cyclin-dependent kinase 6/G1/S-specific cyclin-D3
Type:Protein
Mol. Mass.:n/a
Description:n/a
Components:This complex has 2 components.
Component 1
Name:Cyclin-dependent kinase 6
Synonyms:CDK6 CDKN6 Cyclin-dependent kinase 6 (CDK 6) | Serine/threonine-protein kinase PLSTIRE
Type:Enzyme Subunit
Mol. Mass.:36937.42
Organism:Homo sapiens (Human)
Description:Q00534
Residue:326
Component 2
Name:G1/S-specific cyclin-D3
Synonyms:CCND3 | CCND3_HUMAN
Type:Enzyme
Mol. Mass.:32521.90
Organism:Homo sapiens (Human)
Description:P30281
Residue:292
BDBM50330265
NameBDBM50330265
Synonyms:CHEMBL1271563 | [4-(5-Bromo-3-isopropyl-1H-pyrazol-4-yl)-pyrimidin-2-yl]-(1-methyl-piperidin-4-yl)-amine
TypeSmall organic molecule
Emp. Form.C16H23BrN6
Mol. Mass.379.298
SMILESCC(C)c1[nH]nc(Br)c1-c1ccnc(NC2CCN(C)CC2)n1