Reaction Details
TargetCyclin-dependent kinase 4
LigandBDBM50330266
Substrate/Competitorn/a
Meas. Tech.ChEMBL_676334 (CHEMBL1273635)
IC50 451±n/a nM
Citation Cho, YSBorland, MBrain, CChen, CHCheng, HChopra, RChung, KGroarke, JHe, GHou, YKim, SKovats, SLu, YO'Reilly, MShen, JSmith, TTrakshel, GVögtle, MXu, MXu, MSung, MJ 4-(Pyrazol-4-yl)-pyrimidines as selective inhibitors of cyclin-dependent kinase 4/6. J Med Chem53:7938-57 (2010) 
 
Cyclin-dependent kinase 4
Name:Cyclin-dependent kinase 4
Type:Enzyme Subunit
Mol. Mass.:33731.96
Organism:Homo sapiens (Human)
Description:P11802
Residue:303
BDBM50330266
NameBDBM50330266
Synonyms:4-(3-Isopropyl-1H-pyrazol-4-yl)-N-(5-(piperazin-1-yl)pyridin-2-yl)pyrimidin-2-amine | CHEMBL1271564
TypeSmall organic molecule
Emp. Form.C19H24N8
Mol. Mass.364.4475
SMILESCC(C)c1[nH]ncc1-c1ccnc(Nc2ccc(cn2)N2CCNCC2)n1