Reaction Details
TargetTyrosine-protein kinase JAK1
LigandBDBM50330261
Substrate/Competitorn/a
Meas. Tech.ChEMBL_676345 (CHEMBL1273646)
IC50>10000±n/a nM
Citation Cho, YSBorland, MBrain, CChen, CHCheng, HChopra, RChung, KGroarke, JHe, GHou, YKim, SKovats, SLu, YO'Reilly, MShen, JSmith, TTrakshel, GVögtle, MXu, MXu, MSung, MJ 4-(Pyrazol-4-yl)-pyrimidines as selective inhibitors of cyclin-dependent kinase 4/6. J Med Chem53:7938-57 (2010) 
 
Tyrosine-protein kinase JAK1
Name:Tyrosine-protein kinase JAK1
Type:Protein
Mol. Mass.:133293.73
Organism:Homo sapiens (Human)
Description:P23458
Residue:1154
BDBM50330261
NameBDBM50330261
Synonyms:4-(5-Chloro-3-isopropyl-1H-pyrazol-4-yl)-N-(5-(4-(dimethylamino)piperidin-1-yl)pyridin-2-yl)pyrimidin-2-amine | CHEMBL1272116
TypeSmall organic molecule
Emp. Form.C22H29ClN8
Mol. Mass.440.972
SMILESCC(C)c1n[nH]c(Cl)c1-c1ccnc(Nc2ccc(cn2)N2CCC(CC2)N(C)C)n1