Reaction Details
TargetCarbonic anhydrase 1
LigandBDBM50330329
Substrate/Competitorn/a
Meas. Tech.ChEMBL_685535 (CHEMBL1285702)
IC50 780±n/a nM
Citation Kasimogullari, RBülbül, MArslan, BSGökçe, B Synthesis, characterization and antiglaucoma activity of some novel pyrazole derivatives of 5-amino-1,3,4-thiadiazole-2-sulfonamide. Eur J Med Chem45:4769-73 (2010) 
 
Carbonic anhydrase 1
Name:Carbonic anhydrase 1
Type:Enzyme
Mol. Mass.:28873.37
Organism:Homo sapiens (Human)
Description:P00915
Residue:261
BDBM50330329
NameBDBM50330329
Synonyms:CHEMBL1276019 | Ethyl 1-(3-(2-(1,3-dioxo-1,3-diphenylpropan-2-ylidene)hydrazinyl)phenyl)-5-phenyl-3-(5-sulfamoyl-1,3,4-thiadiazol-2-ylcarbamoyl)-1H-pyrazole-4-carboxylate
TypeSmall organic molecule
Emp. Form.C36H28N8O7S2
Mol. Mass.748.787
SMILES[#6]-[#6]-[#8]-[#6](=O)-c1c(nn(c1-c1ccccc1)-c1cccc(-[#7]\[#7]=[#6](/[#6](=O)-c2ccccc2)-[#6](=O)-c2ccccc2)c1)-[#6](=O)-[#7]-c1nnc(s1)S([#7])(=O)=O