Reaction Details
TargetCarbonic anhydrase 1
LigandBDBM50330333
Substrate/Competitorn/a
Meas. Tech.ChEMBL_685535 (CHEMBL1285702)
IC50 100±n/a nM
Citation Kasimogullari, RBülbül, MArslan, BSGökçe, B Synthesis, characterization and antiglaucoma activity of some novel pyrazole derivatives of 5-amino-1,3,4-thiadiazole-2-sulfonamide. Eur J Med Chem45:4769-73 (2010) 
 
Carbonic anhydrase 1
Name:Carbonic anhydrase 1
Type:Enzyme
Mol. Mass.:28873.37
Organism:Homo sapiens (Human)
Description:P00915
Residue:261
BDBM50330333
NameBDBM50330333
Synonyms:CHEMBL1276023 | Ethyl1-(3-(2-(1-tert-butoxy-1,3-dioxobutan-2-ylidene)hydrazinyl)phenyl)-5-phenyl-3-(5-sulfamoyl-1,3,4-thiadiazol-2-ylcarbamoyl)-1H-pyrazole-4-carboxylate
TypeSmall organic molecule
Emp. Form.C29H30N8O8S2
Mol. Mass.682.727
SMILESCCOC(=O)c1c(nn(c1-c1ccccc1)-c1cccc(NN=C(C(C)=O)C(=O)OC(C)(C)C)c1)C(=O)Nc1nnc(s1)S(N)(=O)=O