Reaction Details
TargetCarbonic anhydrase 2
LigandBDBM50330338
Substrate/Competitorn/a
Meas. Tech.ChEMBL_685536 (CHEMBL1285703)
IC50 210±n/a nM
Citation Kasimogullari, RBülbül, MArslan, BSGökçe, B Synthesis, characterization and antiglaucoma activity of some novel pyrazole derivatives of 5-amino-1,3,4-thiadiazole-2-sulfonamide. Eur J Med Chem45:4769-73 (2010) 
 
Carbonic anhydrase 2
Name:Carbonic anhydrase 2
Type:Enzyme
Mol. Mass.:29250.71
Organism:Homo sapiens (Human)
Description:P00918
Residue:260
BDBM50330338
NameBDBM50330338
Synonyms:CHEMBL1276017 | Ethyl1-(3-(2-(2,4-dioxopentan-3-ylidene)hydrazinyl)phenyl)-5-phenyl-3-(5-sulfamoyl-1,3,4-thiadiazol-2-ylcarbamoyl)-1H-pyrazole-4-carboxylate
TypeSmall organic molecule
Emp. Form.C26H24N8O7S2
Mol. Mass.624.648
SMILES[#6]-[#6]-[#8]-[#6](=O)-c1c(nn(c1-c1ccccc1)-c1cccc(-[#7]\[#7]=[#6](/[#6](-[#6])=O)-[#6](-[#6])=O)c1)-[#6](=O)-[#7]-c1nnc(s1)S([#7])(=O)=O