Reaction Details
TargetCarbonic anhydrase 2
LigandBDBM50330335
Substrate/Competitorn/a
Meas. Tech.ChEMBL_685538 (CHEMBL1285705)
Ki 380±n/a nM
Citation Kasimogullari, RBülbül, MArslan, BSGökçe, B Synthesis, characterization and antiglaucoma activity of some novel pyrazole derivatives of 5-amino-1,3,4-thiadiazole-2-sulfonamide. Eur J Med Chem45:4769-73 (2010) 
 
Carbonic anhydrase 2
Name:Carbonic anhydrase 2
Type:Enzyme
Mol. Mass.:29250.71
Organism:Homo sapiens (Human)
Description:P00918
Residue:260
BDBM50330335
NameBDBM50330335
Synonyms:CHEMBL1276015 | Ethyl1-(3-((2-hydroxynaphthalen-1-yl)diazenyl)phenyl)-5-phenyl-3-(5-sulfamoyl-1,3,4-thiadiazol-2-ylcarbamoyl)-1Hpyrazole-4-carboxylate
TypeSmall organic molecule
Emp. Form.C31H24N8O6S2
Mol. Mass.668.702
SMILESCCOC(=O)c1c(nn(c1-c1ccccc1)-c1cccc(c1)N=Nc1c(O)ccc2ccccc12)C(=O)Nc1nnc(s1)S(N)(=O)=O