Reaction Details
TargetCarbonic anhydrase 2
LigandBDBM50330331
Substrate/Competitorn/a
Meas. Tech.ChEMBL_685538 (CHEMBL1285705)
Ki 120±n/a nM
Citation Kasimogullari, RBülbül, MArslan, BSGökçe, B Synthesis, characterization and antiglaucoma activity of some novel pyrazole derivatives of 5-amino-1,3,4-thiadiazole-2-sulfonamide. Eur J Med Chem45:4769-73 (2010) 
 
Carbonic anhydrase 2
Name:Carbonic anhydrase 2
Type:Enzyme
Mol. Mass.:29250.71
Organism:Homo sapiens (Human)
Description:P00918
Residue:260
BDBM50330331
NameBDBM50330331
Synonyms:CHEMBL1276021 | Ethyl1-(3-(2-(1-ethoxy-1,3-dioxobutan-2-ylidene)hydrazinyl)phenyl)-5-phenyl-3-(5-sulfamoyl-1,3,4-thiadiazol-2-ylcarbamoyl)-1H-pyrazole-4-carboxylate
TypeSmall organic molecule
Emp. Form.C27H26N8O8S2
Mol. Mass.654.674
SMILESCCOC(=O)C(=NNc1cccc(c1)-n1nc(C(=O)Nc2nnc(s2)S(N)(=O)=O)c(C(=O)OCC)c1-c1ccccc1)C(C)=O