Reaction Details
TargetRenin
LigandBDBM50330344
Substrate/Competitorn/a
Meas. Tech.ChEMBL_685577 (CHEMBL1285355)
IC50 1±n/a nM
Citation Webb, RLSchiering, NSedrani, RMaibaum, J Direct renin inhibitors as a new therapy for hypertension. J Med Chem53:7490-520 (2010) 
 
Renin
Name:Renin
Type:Enzyme
Mol. Mass.:45058.99
Organism:Homo sapiens (Human)
Description:n/a
Residue:406
BDBM50330344
NameBDBM50330344
Synonyms:(2S,4S,5S,7R)-4-amino-8-(butylamino)-5-hydroxy-2,7-dimethyl-8-oxooctyl 1-benzyl-1H-indole-3-carboxylate | CHEMBL1276530
TypeSmall organic molecule
Emp. Form.C30H41N3O4
Mol. Mass.507.6642
SMILESCCCCNC(=O)[C@H](C)C[C@H](O)[C@@H](N)C[C@H](C)COC(=O)c1cn(Cc2ccccc2)c2ccccc12