Reaction Details
TargetRenin
LigandBDBM50077689
Substrate/Competitorn/a
Meas. Tech.ChEMBL_685576 (CHEMBL1285354)
IC50 1300±n/a nM
Citation Webb, RLSchiering, NSedrani, RMaibaum, J Direct renin inhibitors as a new therapy for hypertension. J Med Chem53:7490-520 (2010) 
 
Renin
Name:Renin
Type:Enzyme
Mol. Mass.:45058.99
Organism:Homo sapiens (Human)
Description:n/a
Residue:406
BDBM50077689
NameBDBM50077689
Synonyms:(3R,4R)-4-[4-(3-Benzyloxy-propoxy)-phenyl]-3-(naphthalen-2-ylmethoxy)-piperidine CHEMBL31466
TypeSmall organic molecule
Emp. Form.C32H35NO3
Mol. Mass.481.6252
SMILESC(COCc1ccccc1)COc1ccc(cc1)[C@H]1CCNC[C@@H]1OCc1ccc2ccccc2c1