Reaction Details
TargetRenin
LigandBDBM17983
Substrate/Competitorn/a
Meas. Tech.ChEMBL_685577 (CHEMBL1285355)
IC50 20±n/a nM
Citation Webb, RLSchiering, NSedrani, RMaibaum, J Direct renin inhibitors as a new therapy for hypertension. J Med Chem53:7490-520 (2010) 
 
Renin
Name:Renin
Type:Enzyme
Mol. Mass.:45058.99
Organism:Homo sapiens (Human)
Description:n/a
Residue:406
BDBM17983
NameBDBM17983
Synonyms:1,4-benzoxazin-3-one, 20 diaminopyrimidine renin inhibitor compound, 6
TypeSmall organic molecule
Emp. Form.C20H26N6O3
Mol. Mass.398.4588
SMILESCCc1nc(N)nc(N)c1-c1ccc2OC(C)(C)C(=O)N(CCNC(C)=O)c2c1