Reaction Details
TargetRenin
LigandBDBM18012
Substrate/Competitorn/a
Meas. Tech.ChEMBL_685576 (CHEMBL1285354)
IC50 8.9±n/a nM
Citation Webb, RLSchiering, NSedrani, RMaibaum, J Direct renin inhibitors as a new therapy for hypertension. J Med Chem53:7490-520 (2010) 
 
Renin
Name:Renin
Type:Enzyme
Mol. Mass.:45058.99
Organism:Homo sapiens (Human)
Description:n/a
Residue:406
BDBM18012
NameBDBM18012
Synonyms:trans,trans-4-arylpiperidine-based compound, 1
TypeSmall organic molecule
Emp. Form.C38H47NO8
Mol. Mass.645.7817
SMILESCOC[C@@H](O)CO[C@@H]1CNC[C@H](OCc2cc(OC)c3ccccc3c2)[C@H]1c1ccc(OCCCOCc2ccccc2OC)cc1