Reaction Details
TargetRenin
LigandBDBM50330354
Substrate/Competitorn/a
Meas. Tech.ChEMBL_685577 (CHEMBL1285355)
IC50 0.18±n/a nM
Citation Webb, RLSchiering, NSedrani, RMaibaum, J Direct renin inhibitors as a new therapy for hypertension. J Med Chem53:7490-520 (2010) 
 
Renin
Name:Renin
Type:Enzyme
Mol. Mass.:45058.99
Organism:Homo sapiens (Human)
Description:n/a
Residue:406
BDBM50330354
NameBDBM50330354
Synonyms:6-(((R)-1-(4-(3-(2-methoxybenzyloxy)propoxy)phenyl)-6-oxopiperazin-2-yl)methylthio)-4-(3-methoxypropyl)-4,4a-dihydro-2H-benzo[b][1,4]oxazin-3(8aH)-one | CHEMBL1276280
TypeSmall organic molecule
Emp. Form.C34H43N3O7S
Mol. Mass.637.786
SMILESCOCCCN1C2C=C(SC[C@H]3CNCC(=O)N3c3ccc(OCCCOCc4ccccc4OC)cc3)C=CC2OCC1=O