Reaction Details
TargetRenin
LigandBDBM17949
Substrate/Competitorn/a
Meas. Tech.ChEMBL_685576 (CHEMBL1285354)
IC50 1±n/a nM
Citation Webb, RLSchiering, NSedrani, RMaibaum, J Direct renin inhibitors as a new therapy for hypertension. J Med Chem53:7490-520 (2010) 
 
Renin
Name:Renin
Type:Enzyme
Mol. Mass.:45058.99
Organism:Homo sapiens (Human)
Description:n/a
Residue:406
BDBM17949
NameBDBM17949
Synonyms:(2R,4S,5S,7S)-5-amino-N-butyl-4-hydroxy-7-{[4-methoxy-3-(3-methoxypropoxy)phenyl]methyl}-2,8-dimethylnonanamide Renin nonpeptide inhibitor, 9
TypeSmall organic molecule
Emp. Form.C27H48N2O5
Mol. Mass.480.6804
SMILESCCCCNC(=O)[C@H](C)C[C@H](O)[C@@H](N)C[C@H](Cc1ccc(OC)c(OCCCOC)c1)C(C)C