Reaction Details
TargetCathepsin D
LigandBDBM50259465
Substrate/Competitorn/a
Meas. Tech.ChEMBL_685592 (CHEMBL1285370)
IC50 2700±n/a nM
Citation Webb, RLSchiering, NSedrani, RMaibaum, J Direct renin inhibitors as a new therapy for hypertension. J Med Chem53:7490-520 (2010) 
 
Cathepsin D
Name:Cathepsin D
Type:Enzyme
Mol. Mass.:44551.72
Organism:Homo sapiens (Human)
Description:Human proCathepsin D (SwissProt accession number P07339) was expressed in Sf9 cells, purified, and autoactivated.
Residue:412
BDBM50259465
NameBDBM50259465
Synonyms:(1R,5S)-7-{4-[3-(2-Chloro-3,6-difluoro-phenoxy)-propyl]-phenyl}-3,9-diaza-bicyclo[3.3.1]non-6-ene-6-carboxylic acid cyclopropyl-(2,3-dichloro-benzyl)-amide CHEMBL509903
TypeSmall organic molecule
Emp. Form.C33H32Cl3F2N3O2
Mol. Mass.646.982
SMILESFc1ccc(F)c(OCCCc2ccc(cc2)C2=C([C@H]3CNC[C@@H](C2)N3)C(=O)N(Cc2cccc(Cl)c2Cl)C2CC2)c1Cl