Reaction Details
TargetAcyl-CoA desaturase 1
LigandBDBM50330379
Substrate/Competitorn/a
Meas. Tech.ChEMBL_683827 (CHEMBL1285218)
IC50 0.5±n/a nM
Citation Uto, YUeno, YKiyotsuka, YMiyazawa, YKurata, HOgata, TYamada, MDeguchi, TKonishi, MTakagi, TWakimoto, SOhsumi, J Synthesis and evaluation of novel stearoyl-CoA desaturase 1 inhibitors: 1'-{6-[5-(pyridin-3-ylmethyl)-1,3,4-oxadiazol-2-yl]pyridazin-3-yl}-3,4-dihydrospiro[chromene-2,4'-piperidine] analogs. Eur J Med Chem45:4788-96 (2010) 
 
Acyl-CoA desaturase 1
Name:Acyl-CoA desaturase 1
Type:PROTEIN
Mol. Mass.:41064.54
Organism:Mus musculus
Description:ChEMBL_1462109
Residue:355
BDBM50330379
NameBDBM50330379
Synonyms:5,8-Difluoro-1'-{6-[5-(pyridin-3-ylmethyl)-1,3,4-oxadiazol-2-yl]pyridazin-3-yl}-3,4-dihydrospiro[chromene-2,4'-piperidine] | CHEMBL1276623
TypeSmall organic molecule
Emp. Form.C25H22F2N6O2
Mol. Mass.476.478
SMILESFc1ccc(F)c2OC3(CCN(CC3)c3ccc(nn3)-c3nnc(Cc4cccnc4)o3)CCc12