Reaction Details
TargetCytochrome P450 1A1
LigandBDBM50330386
Substrate/Competitorn/a
Meas. Tech.ChEMBL_684297 (CHEMBL1286935)
Kd 2250±n/a nM
Citation Rosales-Hernández, MCMendieta-Wejebe, JETrujillo-Ferrara, JGCorrea-Basurto, J Homology modeling and molecular dynamics of CYP1A1 and CYP2B1 to explore the metabolism of aryl derivatives by docking and experimental assays. Eur J Med Chem45:4845-55 (2010) 
 
Cytochrome P450 1A1
Name:Cytochrome P450 1A1
Type:Protein
Mol. Mass.:58177.23
Organism:Homo sapiens (Human)
Description:P04798
Residue:512
BDBM50330386
NameBDBM50330386
Synonyms:4-(4'-hydroxy-phenylamino)-4-oxo propanoic acid | CHEMBL1275862
TypeSmall organic molecule
Emp. Form.C10H11NO4
Mol. Mass.209.1986
SMILESOC(=O)CCC(=O)Nc1ccc(O)cc1