Reaction Details
TargetCytochrome P450 1A1
LigandBDBM26197
Substrate/Competitorn/a
Meas. Tech.ChEMBL_684297 (CHEMBL1286935)
Kd 19100±n/a nM
Citation Rosales-Hernández, MCMendieta-Wejebe, JETrujillo-Ferrara, JGCorrea-Basurto, J Homology modeling and molecular dynamics of CYP1A1 and CYP2B1 to explore the metabolism of aryl derivatives by docking and experimental assays. Eur J Med Chem45:4845-55 (2010) 
 
Cytochrome P450 1A1
Name:Cytochrome P450 1A1
Type:Protein
Mol. Mass.:58177.23
Organism:Homo sapiens (Human)
Description:P04798
Residue:512
BDBM26197
NameBDBM26197
Synonyms:CHEMBL112 Norco US9333197, Acetaminophen phenol derivative, 11
TypeSmall organic molecule
Emp. Form.C8H9NO2
Mol. Mass.151.1626
SMILESCC(=O)Nc1ccc(O)cc1