Reaction Details
TargetCytochrome P450 2B1
LigandBDBM50330387
Substrate/Competitorn/a
Meas. Tech.ChEMBL_684298 (CHEMBL1286936)
Kd 24000±n/a nM
Citation Rosales-Hernández, MCMendieta-Wejebe, JETrujillo-Ferrara, JGCorrea-Basurto, J Homology modeling and molecular dynamics of CYP1A1 and CYP2B1 to explore the metabolism of aryl derivatives by docking and experimental assays. Eur J Med Chem45:4845-55 (2010) 
 
Cytochrome P450 2B1
Name:Cytochrome P450 2B1
Type:PROTEIN
Mol. Mass.:55940.51
Organism:Rattus norvegicus
Description:ChEMBL_774167
Residue:491
BDBM50330387
NameBDBM50330387
Synonyms:1H-pyrrolidine-1-(4'-hydroxyphenyl)-2,5-dione | CHEMBL1275863
TypeSmall organic molecule
Emp. Form.C10H9NO3
Mol. Mass.191.1834
SMILESOc1ccc(O)n1-c1ccc(O)cc1