Reaction Details
TargetPurine nucleoside phosphorylase
LigandBDBM50330388
Substrate/Competitorn/a
Meas. Tech.ChEMBL_684503 (CHEMBL1287512)
Ki 6000±n/a nM
Citation Cui, HRuda, GFCarrero-Lérida, JRuiz-Pérez, LMGilbert, IHGonzález-Pacanowska, D Exploring new inhibitors of Plasmodium falciparum purine nucleoside phosphorylase. Eur J Med Chem45:5140-9 (2010) 
 
Purine nucleoside phosphorylase
Name:Purine nucleoside phosphorylase
Type:Enzyme
Mol. Mass.:26857.85
Organism:Plasmodium falciparum
Description:n/a
Residue:245
BDBM50330388
NameBDBM50330388
Synonyms:3-((2-Pyrrolidine-1-yl)-ethyl)uracil | CHEMBL1275720
TypeSmall organic molecule
Emp. Form.C10H15N3O2
Mol. Mass.209.245
SMILESO=c1cc[nH]c(=O)n1CCN1CCCC1