Reaction Details
TargetPurine nucleoside phosphorylase
LigandBDBM50330390
Substrate/Competitorn/a
Meas. Tech.ChEMBL_684502 (CHEMBL1287511)
Ki 303±n/a nM
Citation Cui, HRuda, GFCarrero-Lérida, JRuiz-Pérez, LMGilbert, IHGonzález-Pacanowska, D Exploring new inhibitors of Plasmodium falciparum purine nucleoside phosphorylase. Eur J Med Chem45:5140-9 (2010) 
 
Purine nucleoside phosphorylase
Name:Purine nucleoside phosphorylase
Type:Enzyme
Mol. Mass.:32119.53
Organism:Homo sapiens (Human)
Description:n/a
Residue:289
BDBM50330390
NameBDBM50330390
Synonyms:5'-methylthio-immucillin-H | CHEMBL1275659
TypeSmall organic molecule
Emp. Form.C11H14N4O3S
Mol. Mass.282.319
SMILESCS[C@H]1N[C@H]([C@H](O)[C@@H]1O)c1cc2nc[nH]c(=O)c2[nH]1