Reaction Details
TargetPurine nucleoside phosphorylase
LigandBDBM50330396
Substrate/Competitorn/a
Meas. Tech.ChEMBL_684503 (CHEMBL1287512)
IC50 712000±n/a nM
Citation Cui, HRuda, GFCarrero-Lérida, JRuiz-Pérez, LMGilbert, IHGonzález-Pacanowska, D Exploring new inhibitors of Plasmodium falciparum purine nucleoside phosphorylase. Eur J Med Chem45:5140-9 (2010) 
 
Purine nucleoside phosphorylase
Name:Purine nucleoside phosphorylase
Type:Enzyme
Mol. Mass.:26857.85
Organism:Plasmodium falciparum
Description:n/a
Residue:245
BDBM50330396
NameBDBM50330396
Synonyms:1-((3-(l-Prolinol)-1-yl)-propyl)uracil | CHEMBL1275701
TypeSmall organic molecule
Emp. Form.C12H19N3O3
Mol. Mass.253.2976
SMILESOC[C@@H]1CCCN1CCCn1ccc(=O)[nH]c1=O