Reaction Details
TargetPurine nucleoside phosphorylase
LigandBDBM50330398
Substrate/Competitorn/a
Meas. Tech.ChEMBL_684503 (CHEMBL1287512)
IC50 592000±n/a nM
Citation Cui, HRuda, GFCarrero-Lérida, JRuiz-Pérez, LMGilbert, IHGonzález-Pacanowska, D Exploring new inhibitors of Plasmodium falciparum purine nucleoside phosphorylase. Eur J Med Chem45:5140-9 (2010) 
 
Purine nucleoside phosphorylase
Name:Purine nucleoside phosphorylase
Type:Enzyme
Mol. Mass.:26857.85
Organism:Plasmodium falciparum
Description:n/a
Residue:245
BDBM50330398
NameBDBM50330398
Synonyms:1-((4-(l-Prolinol)-1-yl)-butyl)uracil | CHEMBL1275719
TypeSmall organic molecule
Emp. Form.C13H21N3O3
Mol. Mass.267.3241
SMILESOC[C@@H]1CCCN1CCCCn1ccc(=O)[nH]c1=O