Reaction Details
TargetPurine nucleoside phosphorylase
LigandBDBM50195587
Substrate/Competitorn/a
Meas. Tech.ChEMBL_684503 (CHEMBL1287512)
Ki 0.86±n/a nM
Citation Cui, HRuda, GFCarrero-Lérida, JRuiz-Pérez, LMGilbert, IHGonzález-Pacanowska, D Exploring new inhibitors of Plasmodium falciparum purine nucleoside phosphorylase. Eur J Med Chem45:5140-9 (2010) 
 
Purine nucleoside phosphorylase
Name:Purine nucleoside phosphorylase
Type:Enzyme
Mol. Mass.:26857.85
Organism:Plasmodium falciparum
Description:n/a
Residue:245
BDBM50195587
NameBDBM50195587
Synonyms:1,4-DIDEOXY-4-AZA-1-(S)-(9-DEAZAHYPOXANTHIN-9-YL)-D-RIBITOL CHEMBL1213652 Immucillin-H
TypeSmall organic molecule
Emp. Form.C11H14N4O4
Mol. Mass.266.2533
SMILESOC[C@H]1N[C@H]([C@H](O)[C@@H]1O)c1c[nH]c2c1nc[nH]c2=O